BDBM50051247 CHEMBL542310::N-[4-(4-Benzo[d]isothiazol-3-yl-piperazin-1-yl)-butyl]-benzamide; hydrochloride
SMILES O=C(NCCCCN1CCN(CC1)c1nsc2ccccc12)c1ccccc1
InChI Key InChIKey=PNVIFQUVVSDHLW-UHFFFAOYSA-N
Data  2 IC50
  Tab Delimited (TSV)   2D SDfile   Computed 3D by Vconf -m prep SDfile
Find this compound or compounds like it in BindingDB:
Activity Spreadsheet -- Enzyme Inhibition Constant Data from BindingDB
Found 1 hit for monomerid = 50051247
TargetD(2) dopamine receptor(Rattus norvegicus (rat))
Glaxo Wellcome
Curated by ChEMBL
LigandPNGBDBM50051247(CHEMBL542310 | N-[4-(4-Benzo[d]isothiazol-3-yl-pip...)
Affinity DataIC50:  26nM. Assay description: In vitro inhibitory activity against [3H]raclopride binding to dopamine receptor D2
In DepthDetails ArticlePubMed